{"text_format":"1","workbook":"xlsx","n_sheets":5,"sheets":["Input","backup","Dashboard","Planilha1","Input (2)"],"not_rendered":{"charts":2,"images":2,"macros":1,"external_links":0,"defined_names":0,"comments":0,"pivot_tables":0},"unopened":[],"bounds":{"document_bytes":16777216,"sheet_cells":100000,"rows_first":2000,"rows_last":500,"rows_between":2000,"halvings":0,"cell_chars":16384,"cell_head_chars":4096},"cells_cut":0,"cells_raw":0,"read":"whole","date_system":"1900"}

{"sheet":"Input","index":0,"n_rows":114,"n_cols":16,"rows_kept":114,"cut":false,"hidden":false,"merged":[[108,8,109,8],[108,9,109,9],[111,6,113,7],[111,8,113,9],[108,6,109,7],[2,3,4,10],[89,2,89,11],[91,2,91,3],[7,2,7,11],[41,2,41,11],[47,5,47,6],[47,7,47,8],[47,9,47,10]]}
[]
[]
[null,null,null,"Ferramenta de Planejamento Financeiro"]
[]
[]
[]
[]
[null,null,"Situação Atual"]
[]
[null,null,"Estado Civil","Casado(a)",{"$f":"IF(D10=\"Solteiro(a)\",\"Mulher/Homem\",\"Idade Mulher\")","v":"Idade Mulher"},{"$f":"IF(D10=\"Solteiro(a)\",\"\",\"Idade Homem\")","v":"Idade Homem"},1,2,3,4,5,6,6,7,8,9]
[null,null,null,"Idade:"]
[]
[]
[null,null,"Filhos Hoje",null,null,{"$f":"IF($D$14>0,\"1o Filho\",\"\")","v":""},{"$f":"IF($D$14>G10,\"2o Filho\",\"\")","v":""},{"$f":"IF($D$14>H10,\"3o Filho\",\"\")","v":""},{"$f":"IF($D$14>J10,\"5o Filho\",\"\")","v":""},{"$f":"IF($D$14>K10,\"6o Filho\",\"\")","v":""},{"$f":"IF($D$14>L10,\"7o Filho\",\"\")","v":""}]
[null,null,null,null,{"$f":"IF($D$14>0,\"Idade:\",\"\")","v":""}]
[null,null,null,null,null,null,null,","]
[null,null,{"$f":"IF(D14>0,\"Valor Pago de Pensão Alimentícia\",\"\")","v":""}]
[]
[null,null,"Renda Familiar Mensal",{"$f":"+E20+E21+E23+F20+F21+F23+E22+F22","v":0},{"$f":"IF(D10=\"Solteiro(a)\",\"Mulher/Homem\",\"Renda Mulher\")","v":"Renda Mulher"},{"$f":"IF(D10=\"Solteiro(a)\",\"\",\"Renda Homem\")","v":"Renda Homem"}]
[null,null,null,"Salario(s) Líquido na conta corrente (média mensal incluindo bonus, etc)"]
[null,null,null,"Aluguel de Imóvel(s)"]
[null,null,null,"Pensão Recebida"]
[null,null,null,"Outros"]
[]
[null,null,"Disponibilidade (dinheiro e aplicações em conta)"]
[]
[null,null,"Patrimônio (excluindo disponibilidades) a valor de mercado hoje aproximadamente",{"$f":"SUM(E28:F34)","v":0},{"$f":"IF(D10=\"Solteiro(a)\",\"Mulher/Homem\",\"Patrimônio Mulher\")","v":"Patrimônio Mulher"},{"$f":"IF(D10=\"Solteiro(a)\",\"\",\"Patrimônio Homem\")","v":"Patrimônio Homem"}]
[null,null,"Imóvel Residencial",{"$f":"SUM(E28:F28)","v":0}]
[null,null,"Escritório Comercial",{"$f":"SUM(E29:F29)","v":0}]
[null,null,"Galpão",0]
[null,null,"Fazenda",0]
[null,null,"Outros Imóveis",0]
[null,null,"Automóvel",0]
[null,null,"Outros Bens",0]
[]
[null,null,"Dívida (financiamento/emprestimos)",{"$f":"SUM(E37:F38)","v":0},{"$f":"IF(D10=\"Solteiro(a)\",\"Mulher/Homem\",\"Dívida Mulher\")","v":"Dívida Mulher"},{"$f":"IF(D10=\"Solteiro(a)\",\"\",\"Dívida Homem\")","v":"Dívida Homem"}]
[null,null,"Financiamento",{"$f":"SUM(E37:F37)","v":0}]
[null,null,"Emprestimos familiares",{"$f":"SUM(E38:F38)","v":0}]
[]
[]
[]
[null,null,"Planejamento Familiar"]
[null,null,null,null,{"$f":"IF(D10=\"Casado(a)\",\"Mulher\",\"Mulher/Homem\")","v":"Mulher"},{"$f":"IF(D10=\"Casado(a)\",\"Homem\",\"\")","v":"Homem"}]
[null,null,"Quandos anos mais deseja trabalhar?"]
[]
[null,null,"Quantos filhos pretende ter?",null,null,null,"Inserir um \"X\" nos itens desejados abaixo"]
[]
[null,null,null,null,"Valores Considerados","PADRÃO SUPERIOR (R$)",null,"MÉDIA (R$)",null,"PADRÃO INFERIOR (R$)"]
[null,null,"Condomínio / Iptu",{"$f":"IF($E$11<>\"\",1,0)","v":0},{"$f":"IF(G49=\"x\",F49,IF(I49=\"x\",H49,IF(K49=\"x\",J49,0)))","v":0},2500,null,1500,null,1000]
[null,null,"Água",{"$f":"IF($E$11<>\"\",1,0)","v":0},0,100,null,30,null,15]
[null,null,"Energia Elétrica",0,0,450,null,220,null,110]
[null,null,"TV / Internet Cabo",0,0,450,null,250,null,80]
[null,null,"Aluguel",0,0,6000,null,2500,null,1100]
[null,null,"Reposição de Automóvel (provisão mensal)",{"$f":"ROUNDUP(D33/50000,0)","v":0},{"$f":"IF(G54=\"x\",F54,IF(I54=\"x\",H54,IF(K54=\"x\",J54,0)))","v":0},0,null,0,null,0]
[null,null,"Combustível",{"$f":"IF(ROUNDUP(D33/50000,0)=0,1,ROUNDUP(D33/50000,0))","v":1},{"$f":"IF(G55=\"x\",F55,IF(I55=\"x\",H55,IF(K55=\"x\",J55,0)))","v":0},480,null,240,null,120]
[null,null,"Compra de bens não duráveis (celular, geladeira, TV, sofá...)",{"$f":"((IF($D$10=\"Casado(a)\",2,IF($E$11<>\"\",1,0))))","v":2},{"$f":"IF(G56=\"x\",F56,IF(I56=\"x\",H56,IF(K56=\"x\",J56,0)))","v":0},333.33333333333331,null,250,null,83.333333333333329]
[null,null,"Academia de Ginastica / Esporte / Pilates / Fisioterapia",2,{"$f":"IF(G57=\"x\",F57,IF(I57=\"x\",H57,IF(K57=\"x\",J57,0)))","v":0},1000,null,400,null,200]
[null,null,"Terapia / Meditação",2,0,1100,null,792.00000000000011,null,360]
[null,null,"Saúde (remédio, consultas)",2,0,600,null,200,null,100]
[null,null,"Dentista",2,0,100,null,50,null,20]
[null,null,"Jantares com Amigos / Família",2,0,800,null,540,null,200]
[null,null,"Celular",2,0,300,null,140,null,50]
[null,null,"Presentes para ocasiões especiais (Parentes, Amigos)",2,0,300,null,150,null,100]
[null,null,"Empregada/Faxineira",0,{"$f":"IF(G64=\"x\",F64,IF(I64=\"x\",H64,IF(K64=\"x\",J64,0)))","v":0},3872,null,1056,null,660]
[null,null,"Escola de Linguas (Adulto)",2,0,1584.0000000000002,null,1056,null,880.00000000000011]
[null,null,"Pós-Graduação / MBA (considerando o casal)",2,0,2500,null,1500,null,500]
[null,null,"Cinema & Pipoca per capta da família",{"$f":"($D$46+(IF($D$10=\"Casado(a)\",2,IF($E$11<>\"\",1,0))+IF(COUNTA(D14)-COUNTA(D17)=0,0,D14)))","v":2},0,75,null,40,null,25]
[null,null,"Mensalidade Clube",{"$f":"($D$46+COUNTA($E$11:$F$11)+IF(COUNTA($D$14)-COUNTA($D$17)>0,$D$14,0))","v":0},0,300,null,120,null,0]
[null,null,"Viagem de Férias",{"$f":"($D$46+COUNTA($E$11:$F$11)+IF(COUNTA($D$14)-COUNTA($D$17)>0,$D$14,0))","v":0},0,666.66666666666663,null,500,null,166.66666666666666]
[null,null,"Farmácia per capta da família",{"$f":"($D$46+(IF($D$10=\"Casado(a)\",2,IF($E$11<>\"\",1,0))+IF(COUNTA(D14)-COUNTA(D17)=0,0,D14)))","v":2},0,350,null,200,null,100]
[null,null,"Roupa per capta da família",{"$f":"($D$46+(IF($D$10=\"Casado(a)\",2,IF($E$11<>\"\",1,0))+IF(COUNTA(D14)-COUNTA(D17)=0,0,D14)))","v":2},0,120,null,60,null,30]
[null,null,"Escola de Linguas (Infantil)",{"$f":"($D$46+IF(COUNTA($D$14)-COUNTA($D$17)>0,$D$14,0))","v":0},0,1584.0000000000002,null,1056,null,880.00000000000011]
[null,null,"Baba",{"$f":"IF((D46+COUNTIF(D14,1)+COUNTIF(D14,2)+COUNTIF(D14,3)+COUNTIF(D14,4)+COUNTIF(D14,5)+COUNTIF(D14,6)-COUNTA(D17))>0,1,0)","v":0},0,4800,null,3840,null,1152]
[null,null,"Escola",{"$f":"($D$46+IF(COUNTA($D$14)-COUNTA($D$17)>0,$D$14,0))","v":0},{"$f":"IF(G74=\"x\",F74,IF(I74=\"x\",H74,IF(K74=\"x\",J74,0)))","v":0},3500,null,2000,null,1000]
[null,null,"Motorista",{"$f":"IF((D46+COUNTIF(D14,1)+COUNTIF(D14,2)+COUNTIF(D14,3)+COUNTIF(D14,4)+COUNTIF(D14,5)+COUNTIF(D14,6)-COUNTA(D17))>0,1,0)","v":0},0,5500,null,3500,null,3500]
[null,null,"Transporte Escolar",0,0,580,null,226,null,150]
[null,null,"Material Escolar (mensalizado)",0,0,50,null,40,null,20]
[null,null,"Livros de Escola / Revistas / Etc (mês)",0,0,100,null,50,null,20]
[null,null,"Uniforme Escolar (mensalizado)",0,0,37.5,null,16.666666666666668,null,10]
[null,null,"Atividades fora da Escola (passeios) por pessoa mês",0,0,100,null,66.666666666666671,null,25]
[null,null,"Alimentação (Supermercado, lanches escola/esporte, etc)",{"$f":"($D$46+(IF($D$10=\"Casado(a)\",2,IF($E$11<>\"\",1,0))+IF(COUNTA(D14)-COUNTA(D17)=0,0,D14)))","v":2},0,1500,null,1000,null,650]
[null,null,"Outros (preencher)",{"$f":"($D$46+(IF($D$10=\"Casado(a)\",2,IF($E$11<>\"\",1,0))+IF(COUNTA(D13)-COUNTA(D16)=0,0,D13)))","v":2},0]
[null,null,"Outros (preencher)",2,0]
[null,null,"Outros (preencher)",2,0]
[null,null,"Outros (preencher)",{"$f":"($D$46+(IF($D$10=\"Casado(a)\",2,IF($E$11<>\"\",1,0))+IF(COUNTA(D16)-COUNTA(D19)=0,0,D16)))","v":2},0]
[null,null,"Total Mensal Esperado",null,{"$f":"SUMPRODUCT(E49:E85,D49:D85)","v":0}]
[]
[]
[]
[null,null,{"$f":"+D20","v":"Salario(s) Líquido na conta corrente (média mensal incluindo bonus, etc)"}]
[]
[null,null,"Renda Atual x Despesa Projetada"]
[null,null,"Renda",{"$f":"+D19","v":0}]
[null,null,"Despesa Projetada",{"$f":"-(E86+D17)","v":0}]
[null,null,"Saldo Final (mês)",{"$f":"SUM(D93:D94)","v":0}]
[]
[]
[null,null,"Estime uma Renda Média para Estes Anos Produtivos tomando por base a renda atual","Mulher","Homem"]
[null,null,"Salario(s) Líquido na conta corrente",{"$f":"E20","v":0},{"$f":"F20","v":0}]
[null,null,"Aluguel de Imóvel(s)",{"$f":"E21","v":0},0]
[null,null,"Pensão Recebida",{"$f":"E22","v":0},0]
[null,null,"Outros",{"$f":"E23","v":0},0]
[null,null,"Total",{"$f":"SUM(D99:D102)*12","v":0},{"$f":"SUM(E99:E102)*12","v":0}]
[null,null,null,null,null,null,null,null,"Mulher","Homem"]
[null,null,"Reserva Projetada para o fim dos Anos Produtivos",null,null,null,"Expectativa de Vida:",null,80,80]
[null,null,"Renda",{"$f":"D103*E44+E103*F44","v":0},null,null,"Anos de aposentadoria",null,{"$f":"+I105-E11-E44","v":80},{"$f":"+J105-F11-F44","v":80}]
[]
[null,null,"Pensão Alimentícia",{"$f":"(IF(F14<>\"\",-D17/D14*12*(21-F15),0)-IF(G14<>\"\",D17/D14*12*(21-G15),0)-IF(H14<>\"\",D17/D14*12*(21-H15),0)-IF(I14<>\"\",D17/D14*12*(21-I15),0)-IF(J14<>\"\",D17/D14*12*(21-J15),0)-IF(K14<>\"\",D17/D14*12*(21-K15),0))","v":0}]
[null,null,"Despesas projetadas",{"$f":"-E86*F44*12","v":0},null,null,"Disponibilidade Mensal (aposentadoria)",null,{"$f":"+D114/SUM(I106:J106)/12","v":0},{"$f":"+D114/SUM(I106:J106)/12","v":0}]
[null,null,"Reserva de Caixa (R$) Acumulado",{"$f":"SUM(D106:D109)","v":0}]
[null,null,null,null,null,null,"não considera INSS"]
[null,null,"Disponibilidade Financeira",{"$f":"D25","v":0},null,null,"Reserva de Caixa Após expectativa de Vida",null,{"$f":"+I106*I109*12+J106*J109*12-D114","v":0}]
[]
[null,null,"Reserva de Caixa (R$) Após disponibilidade financeira",{"$f":"+D110+D112","v":0}]

{"sheet":"backup","index":1,"n_rows":114,"n_cols":16,"rows_kept":114,"cut":false,"hidden":true,"merged":[[111,6,113,7],[111,8,113,9],[2,3,4,10],[7,2,7,11],[41,2,41,11],[47,5,47,6],[47,7,47,8],[47,9,47,10],[89,2,89,11],[91,2,91,3],[108,6,109,7],[108,8,109,8],[108,9,109,9]]}
[]
[]
[null,null,null,"Ferramenta de Planejamento Financeiro"]
[]
[]
[]
[]
[null,null,"Situação Atual"]
[]
[null,null,"Estado Civil","Casado(a)",{"$f":"IF(D10=\"Solteiro(a)\",\"Mulher/Homem\",\"Idade Mulher\")","v":"Idade Mulher"},{"$f":"IF(D10=\"Solteiro(a)\",\"\",\"Idade Homem\")","v":"Idade Homem"},1,2,3,4,5,6,6,7,8,9]
[null,null,null,"Idade:",35,40]
[]
[]
[null,null,"Filhos Hoje",3,null,{"$f":"IF($D$14>0,\"1o Filho\",\"\")","v":"1o Filho"},{"$f":"IF($D$14>G10,\"2o Filho\",\"\")","v":"2o Filho"},{"$f":"IF($D$14>H10,\"3o Filho\",\"\")","v":"3o Filho"},{"$f":"IF($D$14>J10,\"5o Filho\",\"\")","v":""},{"$f":"IF($D$14>K10,\"6o Filho\",\"\")","v":""},{"$f":"IF($D$14>L10,\"7o Filho\",\"\")","v":""}]
[null,null,null,null,{"$f":"IF($D$14>0,\"Idade:\",\"\")","v":"Idade:"},11,8,8]
[null,null,null,null,null,null,null,","]
[null,null,{"$f":"IF(D14>0,\"Valor Pago de Pensão Alimentícia\",\"\")","v":"Valor Pago de Pensão Alimentícia"},9400]
[]
[null,null,"Renda Familiar Mensal",{"$f":"+E20+E21+E23+F20+F21+F23+E22+F22","v":26000},{"$f":"IF(D10=\"Solteiro(a)\",\"Mulher/Homem\",\"Renda Mulher\")","v":"Renda Mulher"},{"$f":"IF(D10=\"Solteiro(a)\",\"\",\"Renda Homem\")","v":"Renda Homem"}]
[null,null,null,"Salario(s) Líquido na conta corrente (média mensal incluindo bonus, etc)",10000,16000]
[null,null,null,"Aluguel de Imóvel(s)"]
[null,null,null,"Pensão Recebida"]
[null,null,null,"Outros"]
[]
[null,null,"Disponibilidade (dinheiro e aplicações em conta)",500000]
[]
[null,null,"Patrimônio (excluindo disponibilidades) a valor de mercado hoje aproximadamente",{"$f":"SUM(E28:F34)","v":1350000},{"$f":"IF(D10=\"Solteiro(a)\",\"Mulher/Homem\",\"Patrimônio Mulher\")","v":"Patrimônio Mulher"},{"$f":"IF(D10=\"Solteiro(a)\",\"\",\"Patrimônio Homem\")","v":"Patrimônio Homem"}]
[null,null,"Imóvel Residencial",{"$f":"SUM(E28:F28)","v":1300000},650000,650000]
[null,null,"Escritório Comercial",{"$f":"SUM(E29:F29)","v":0}]
[null,null,"Galpão",0]
[null,null,"Fazenda",0]
[null,null,"Outros Imóveis",0]
[null,null,"Automóvel",50000,50000]
[null,null,"Outros Bens",0]
[]
[null,null,"Dívida (financiamento/emprestimos)",{"$f":"SUM(E37:F38)","v":0},{"$f":"IF(D10=\"Solteiro(a)\",\"Mulher/Homem\",\"Dívida Mulher\")","v":"Dívida Mulher"},{"$f":"IF(D10=\"Solteiro(a)\",\"\",\"Dívida Homem\")","v":"Dívida Homem"}]
[null,null,"Financiamento",{"$f":"SUM(E37:F37)","v":0}]
[null,null,"Emprestimos familiares",{"$f":"SUM(E38:F38)","v":0}]
[]
[]
[]
[null,null,"Planejamento Familiar"]
[null,null,null,null,{"$f":"IF(D10=\"Casado(a)\",\"Mulher\",\"Mulher/Homem\")","v":"Mulher"},{"$f":"IF(D10=\"Casado(a)\",\"Homem\",\"\")","v":"Homem"}]
[null,null,"Quandos anos mais deseja trabalhar?",null,15,10]
[]
[null,null,"Quantos filhos pretende ter?",1,null,null,"Inserir um \"X\" nos itens desejados abaixo",null,null,null,null,null,null,null,null,1]
[]
[null,null,null,null,"Valores Considerados","PADRÃO SUPERIOR (R$)",null,"MÉDIA (R$)",null,"PADRÃO INFERIOR (R$)"]
[null,null,"Condomínio / Iptu",{"$f":"IF($E$11<>\"\",1,0)","v":1},{"$f":"IF(G49=\"x\",F49,IF(I49=\"x\",H49,IF(K49=\"x\",J49,0)))","v":1500},2500,null,1500,"x",1000]
[null,null,"Água",{"$f":"IF($E$11<>\"\",1,0)","v":1},30,100,null,30,"x",15]
[null,null,"Energia Elétrica",1,220,450,null,220,"x",110]
[null,null,"TV / Internet Cabo",1,250,450,null,250,"x",80]
[null,null,"Aluguel",1,2500,6000,null,2500,"x",1100]
[null,null,"Reposição de Automóvel (provisão mensal)",{"$f":"ROUNDUP(D33/50000,0)","v":1},{"$f":"IF(G54=\"x\",F54,IF(I54=\"x\",H54,IF(K54=\"x\",J54,0)))","v":0},0,null,0,"x",0]
[null,null,"Combustível",{"$f":"IF(ROUNDUP(D33/50000,0)=0,1,ROUNDUP(D33/50000,0))","v":1},{"$f":"IF(G55=\"x\",F55,IF(I55=\"x\",H55,IF(K55=\"x\",J55,0)))","v":240},480,null,240,"x",120]
[null,null,"Compra de bens não duráveis (celular, geladeira, TV, sofá...)",{"$f":"((IF($D$10=\"Casado(a)\",2,IF($E$11<>\"\",1,0))))","v":2},{"$f":"IF(G56=\"x\",F56,IF(I56=\"x\",H56,IF(K56=\"x\",J56,0)))","v":250},333.33333333333331,null,250,"x",83.333333333333329]
[null,null,"Academia de Ginastica / Esporte / Pilates / Fisioterapia",2,{"$f":"IF(G57=\"x\",F57,IF(I57=\"x\",H57,IF(K57=\"x\",J57,0)))","v":400},1000,null,400,"x",200]
[null,null,"Terapia / Meditação",2,792.00000000000011,1100,null,792.00000000000011,"x",360]
[null,null,"Saúde (remédio, consultas)",2,200,600,null,200,"x",100]
[null,null,"Dentista",2,50,100,null,50,"x",20]
[null,null,"Jantares com Amigos / Família",2,540,800,null,540,"x",200]
[null,null,"Celular",2,140,300,null,140,"x",50]
[null,null,"Presentes para ocasiões especiais (Parentes, Amigos)",2,150,300,null,150,"x",100]
[null,null,"Empregada/Faxineira",1,1056,3872,null,1056,"x",660]
[null,null,"Escola de Linguas (Adulto)",2,1056,1584.0000000000002,null,1056,"x",880.00000000000011]
[null,null,"Pós-Graduação / MBA (considerando o casal)",2,1500,2500,null,1500,"x",500]
[null,null,"Cinema & Pipoca per capta da família",{"$f":"($D$46+(IF($D$10=\"Casado(a)\",2,IF($E$11<>\"\",1,0))+IF(COUNTA(D14)-COUNTA(D17)=0,0,D14)))","v":3},40,75,null,40,"x",25]
[null,null,"Mensalidade Clube",{"$f":"($D$46+COUNTA($E$11:$F$11)+IF(COUNTA($D$14)-COUNTA($D$17)>0,$D$14,0))","v":3},120,300,null,120,"x",0]
[null,null,"Viagem de Férias",{"$f":"($D$46+COUNTA($E$11:$F$11)+IF(COUNTA($D$14)-COUNTA($D$17)>0,$D$14,0))","v":3},500,666.66666666666663,null,500,"x",166.66666666666666]
[null,null,"Farmácia per capta da família",{"$f":"($D$46+(IF($D$10=\"Casado(a)\",2,IF($E$11<>\"\",1,0))+IF(COUNTA(D14)-COUNTA(D17)=0,0,D14)))","v":3},200,350,null,200,"x",100]
[null,null,"Roupa per capta da família",{"$f":"($D$46+(IF($D$10=\"Casado(a)\",2,IF($E$11<>\"\",1,0))+IF(COUNTA(D14)-COUNTA(D17)=0,0,D14)))","v":3},60,120,null,60,"x",30]
[null,null,"Escola de Linguas (Infantil)",{"$f":"($D$46+IF(COUNTA($D$14)-COUNTA($D$17)>0,$D$14,0))","v":1},1056,1584.0000000000002,null,1056,"x",880.00000000000011]
[null,null,"Baba",{"$f":"IF((D46+COUNTIF(D14,1)+COUNTIF(D14,2)+COUNTIF(D14,3)+COUNTIF(D14,4)+COUNTIF(D14,5)+COUNTIF(D14,6)-COUNTA(D17))>0,1,0)","v":1},3840,4800,null,3840,"x",1152]
[null,null,"Escola",{"$f":"($D$46+IF(COUNTA($D$14)-COUNTA($D$17)>0,$D$14,0))","v":1},2000,3500,null,2000,"x",1000]
[null,null,"Motorista",{"$f":"IF((D46+COUNTIF(D14,1)+COUNTIF(D14,2)+COUNTIF(D14,3)+COUNTIF(D14,4)+COUNTIF(D14,5)+COUNTIF(D14,6)-COUNTA(D17))>0,1,0)","v":1},3500,5500,null,3500,"x",3500]
[null,null,"Transporte Escolar",1,226,580,null,226,"x",150]
[null,null,"Material Escolar (mensalizado)",1,40,50,null,40,"x",20]
[null,null,"Livros de Escola / Revistas / Etc (mês)",1,50,100,null,50,"x",20]
[null,null,"Uniforme Escolar (mensalizado)",1,16.666666666666668,37.5,null,16.666666666666668,"x",10]
[null,null,"Atividades fora da Escola (passeios) por pessoa mês",1,66.666666666666671,100,null,66.666666666666671,"x",25]
[null,null,"Alimentação (Supermercado, lanches escola/esporte, etc)",{"$f":"($D$46+(IF($D$10=\"Casado(a)\",2,IF($E$11<>\"\",1,0))+IF(COUNTA(D14)-COUNTA(D17)=0,0,D14)))","v":3},1000,1500,null,1000,"x",650]
[null,null,"Outros (preencher)",{"$f":"($D$46+(IF($D$10=\"Casado(a)\",2,IF($E$11<>\"\",1,0))+IF(COUNTA(D13)-COUNTA(D16)=0,0,D13)))","v":3},null,null,null,null,"x"]
[null,null,"Outros (preencher)",3,null,null,null,null,"x"]
[null,null,"Outros (preencher)",3,null,null,null,null,"x"]
[null,null,"Outros (preencher)",3,0,null,null,null,"x"]
[null,null,"Total Mensal Esperado",null,{"$f":"SUMPRODUCT(E49:E85,D49:D85)","v":32507.333333333336}]
[]
[]
[]
[null,null,{"$f":"+D20","v":"Salario(s) Líquido na conta corrente (média mensal incluindo bonus, etc)"}]
[]
[null,null,"Renda Atual x Despesa Projetada"]
[null,null,"Renda",{"$f":"+D19","v":26000}]
[null,null,"Despesa Projetada",{"$f":"-(E86+D17)","v":-41907.333333333336}]
[null,null,"Saldo Final (mês)",{"$f":"SUM(D93:D94)","v":-15907.333333333336}]
[]
[]
[null,null,"Estime uma Renda Média para Estes Anos Produtivos tomando por base a renda atual","Mulher","Homem"]
[null,null,"Salario(s) Líquido na conta corrente",{"$f":"E20","v":10000},{"$f":"F20","v":16000}]
[null,null,"Aluguel de Imóvel(s)",{"$f":"E21","v":0},0]
[null,null,"Pensão Recebida",0,0]
[null,null,"Outros",0,0]
[null,null,"Total",{"$f":"SUM(D99:D102)*12","v":120000},{"$f":"SUM(E99:E102)*12","v":192000}]
[null,null,null,null,null,null,null,null,"Mulher","Homem"]
[null,null,"Reserva Projetada para o fim dos Anos Produtivos",null,null,null,"Expectativa de Vida:",null,80,80]
[null,null,"Renda",{"$f":"D103*E44+E103*F44","v":3720000},null,null,"Anos de aposentadoria",null,{"$f":"+I105-E11-E44","v":30},{"$f":"+J105-F11-F44","v":30}]
[]
[null,null,"Pensão Alimentícia",{"$f":"(IF(F14<>\"\",-D17/D14*12*(21-F15),0)-IF(G14<>\"\",D17/D14*12*(21-G15),0)-IF(H14<>\"\",D17/D14*12*(21-H15),0)-IF(I14<>\"\",D17/D14*12*(21-I15),0)-IF(J14<>\"\",D17/D14*12*(21-J15),0)-IF(K14<>\"\",D17/D14*12*(21-K15),0))","v":-1353600}]
[null,null,"Despesas projetadas",{"$f":"-E86*F44*12","v":-3900880.0000000005},null,null,"Disponibilidade Mensal (aposentadoria)",null,{"$f":"+D114/SUM(I106:J106)/12","v":-1436.7777777777783},{"$f":"+D114/SUM(I106:J106)/12","v":-1436.7777777777783}]
[null,null,"Reserva de Caixa (R$) Acumulado",{"$f":"SUM(D106:D109)","v":-1534480.0000000005}]
[null,null,null,null,null,null,"não considera INSS"]
[null,null,"Disponibilidade Financeira",{"$f":"D25","v":500000},null,null,"Reserva de Caixa Após expectativa de Vida",null,{"$f":"+I106*I109*12+J106*J109*12-D114","v":0}]
[]
[null,null,"Reserva de Caixa (R$) Após disponibilidade financeira",{"$f":"+D110+D112","v":-1034480.0000000005}]

{"sheet":"Dashboard","index":2,"n_rows":77,"n_cols":26,"rows_kept":77,"cut":false,"hidden":false,"merged":[[70,2,70,7]]}
[]
[]
[]
[]
[]
[]
[]
[]
[]
[]
[]
[]
[]
[]
[]
[]
[]
[]
[]
[]
[]
[]
[]
[]
[]
[]
[null,null,null,null,null,null,null,null,null,null,null,-19792,null,null,null,null,null,-37882.666666666701]
[]
[]
[null,null,null,null,null,null,null,null,null,null,null,-19792,null,null,null,null,null,-37882.666666666701]
[]
[]
[]
[]
[]
[]
[]
[]
[]
[]
[]
[]
[]
[]
[]
[]
[]
[]
[]
[]
[]
[]
[]
[]
[]
[]
[]
[]
[]
[]
[]
[]
[]
[]
[]
[]
[]
[]
[]
[]
[null,null,"Patrimônio Hoje",null,null,null,null,null,null,null,null,"Fluxo de Caixa Hoje",null,null,null,null,null,"Fluxo de Caixa Futuro (c/família)",null,null,null,null,null,null,null,"Patrimônio Futuro"]
[null,"Disponibilidade",{"$f":"Input!D25","v":0},null,null,null,null,null,null,null,"Renda Familiar",{"$f":"Input!D19","v":0},null,null,null,null,"Renda Familiar",{"$f":"SUM(Input!D99:E102)","v":0},null,null,null,null,"Disponibilidade",{"$f":"Input!D114","v":0}]
[null,"Patrimônio Imobilizado",{"$f":"Input!D27","v":0},null,null,null,null,null,null,null,"Despesa Familiar",0,null,null,null,null,"Despesa Familiar",0,null,null,null,null,"Patrimônio Imobilizado",{"$f":"Input!Y27","v":0}]
[null,"Divida / Financiamento",{"$f":"-Input!D36","v":0},null,null,null,null,null,null,null,"Saldo Final",{"$f":"SUM(L72:L73)","v":0},null,null,null,null,"Saldo Final",{"$f":"SUM(R72:R73)","v":0},null,null,null,null,"Divida / Financiamento",0]
[null,"Total",{"$f":"SUM(C72:C74)","v":0},null,null,null,null,null,null,null,null,null,null,null,null,null,null,null,null,null,null,null,"Total",{"$f":"SUM(X72:X74)","v":0}]
[]
[null,null,null,null,null,null,null,null,null,null,null,null,-28063.333333333336]

{"sheet":"Planilha1","index":3,"n_rows":114,"n_cols":16,"rows_kept":114,"cut":false,"hidden":false,"merged":[[89,2,89,11],[91,2,91,3],[2,3,4,10],[7,2,7,11],[41,2,41,11],[47,5,47,6],[47,7,47,8],[47,9,47,10]]}
[]
[]
[null,null,null,"Ferramenta de Planejamento Financeiro"]
[]
[]
[]
[]
[null,null,"Situação Atual"]
[]
[null,null,"Estado Civil","Casado(a)",{"$f":"IF(D10=\"Solteiro(a)\",\"Mulher/Homem\",\"Idade Mulher\")","v":"Idade Mulher"},{"$f":"IF(D10=\"Solteiro(a)\",\"\",\"Idade Homem\")","v":"Idade Homem"},1,2,3,4,5,6,6,7,8,9]
[null,null,null,"Idade:"]
[]
[]
[null,null,"Filhos Hoje",0,null,{"$f":"IF($D$14>0,\"1o Filho\",\"\")","v":""},{"$f":"IF($D$14>G10,\"2o Filho\",\"\")","v":""},{"$f":"IF($D$14>H10,\"3o Filho\",\"\")","v":""},{"$f":"IF($D$14>J10,\"5o Filho\",\"\")","v":""},{"$f":"IF($D$14>K10,\"6o Filho\",\"\")","v":""},{"$f":"IF($D$14>L10,\"7o Filho\",\"\")","v":""}]
[null,null,null,null,{"$f":"IF($D$14>0,\"Idade:\",\"\")","v":""}]
[null,null,null,null,null,null,null,","]
[null,null,{"$f":"IF(D14>0,\"Valor Pago de Pensão Alimentícia\",\"\")","v":""}]
[]
[null,null,"Renda Familiar Mensal",{"$f":"+E20+E21+E23+F20+F21+F23","v":0},{"$f":"IF(D10=\"Solteiro(a)\",\"Mulher/Homem\",\"Renda Mulher\")","v":"Renda Mulher"},{"$f":"IF(D10=\"Solteiro(a)\",\"\",\"Renda Homem\")","v":"Renda Homem"}]
[null,null,null,"Salario(s) Líquido na conta corrente (média mensal incluindo bonus, etc)"]
[null,null,null,"Aluguel de Imóvel(s)"]
[null,null,null,"Pensão Recebida"]
[null,null,null,"Outros"]
[]
[null,null,"Disponibilidade (dinheiro e aplicações em conta)"]
[]
[null,null,"Patrimônio (excluindo disponibilidades) a valor de mercado hoje aproximadamente",{"$f":"SUM(E28:F34)","v":0},{"$f":"IF(D10=\"Solteiro(a)\",\"Mulher/Homem\",\"Patrimônio Mulher\")","v":"Patrimônio Mulher"},{"$f":"IF(D10=\"Solteiro(a)\",\"\",\"Patrimônio Homem\")","v":"Patrimônio Homem"}]
[null,null,"Imóvel Residencial",{"$f":"SUM(E28:F28)","v":0}]
[null,null,"Escritório Comercial",{"$f":"SUM(E29:F29)","v":0}]
[null,null,"Galpão",0]
[null,null,"Fazenda",0]
[null,null,"Outros Imóveis",0]
[null,null,"Automóvel",0]
[null,null,"Outros Bens",0]
[]
[null,null,"Dívida (financiamento/emprestimos)",{"$f":"SUM(E37:F38)","v":0},{"$f":"IF(D10=\"Solteiro(a)\",\"Mulher/Homem\",\"Dívida Mulher\")","v":"Dívida Mulher"},{"$f":"IF(D10=\"Solteiro(a)\",\"\",\"Dívida Homem\")","v":"Dívida Homem"}]
[null,null,"Financiamento",{"$f":"SUM(E37:F37)","v":0}]
[null,null,"Emprestimos familiares",{"$f":"SUM(E38:F38)","v":0}]
[]
[]
[]
[null,null,"Planejamento Familiar"]
[null,null,null,null,{"$f":"IF(D10=\"Casado(a)\",\"Mulher\",\"Mulher/Homem\")","v":"Mulher"},{"$f":"IF(D10=\"Casado(a)\",\"Homem\",\"\")","v":"Homem"}]
[null,null,"Quandos anos mais deseja trabalhar?",null,10,5]
[]
[null,null,"Quantos filhos pretende ter?",0,null,null,"Inserir um \"X\" nos itens desejados abaixo"]
[]
[null,null,null,null,"Valores Considerados","PADRÃO SUPERIOR (R$)",null,"MÉDIA (R$)",null,"PADRÃO INFERIOR (R$)"]
[null,null,"Condomínio / Iptu",{"$f":"IF($E$11<>\"\",1,0)","v":0},{"$f":"IF(G49=\"x\",F49,IF(I49=\"x\",H49,IF(K49=\"x\",J49,0)))","v":0},2500,null,1500,null,1000]
[null,null,"Água",{"$f":"IF($E$11<>\"\",1,0)","v":0},0,100,null,30,null,15]
[null,null,"Energia Elétrica",0,0,450,null,220,null,110]
[null,null,"TV / Internet Cabo",0,0,450,null,250,null,80]
[null,null,"Aluguel",0,0,6000,null,2500,null,1100]
[null,null,"Reposição de Automóvel (provisão mensal)",{"$f":"ROUNDUP(D33/50000,0)","v":0},{"$f":"IF(G54=\"x\",F54,IF(I54=\"x\",H54,IF(K54=\"x\",J54,0)))","v":0},{"$f":"+($D$33*2)/(5*12)","v":0},null,{"$f":"+($D$33*1.5)/(5*12)","v":0},null,{"$f":"+($D$33*1)/(5*12)","v":0}]
[null,null,"Combustível",{"$f":"ROUNDUP(D33/50000,0)","v":0},{"$f":"IF(G55=\"x\",F55,IF(I55=\"x\",H55,IF(K55=\"x\",J55,0)))","v":0},{"$f":"240*2","v":480},null,240,null,120]
[null,null,"Compra de bens não duráveis (celular, geladeira, TV, sofá...)",{"$f":"((IF($D$10=\"Casado(a)\",2,IF($E$11<>\"\",1,0))))","v":2},{"$f":"IF(G56=\"x\",F56,IF(I56=\"x\",H56,IF(K56=\"x\",J56,0)))","v":0},{"$f":"4000/12","v":333.33333333333331},null,{"$f":"3000/12","v":250},null,83.333333333333329]
[null,null,"Academia de Ginastica / Esporte / Pilates / Fisioterapia",2,{"$f":"IF(G57=\"x\",F57,IF(I57=\"x\",H57,IF(K57=\"x\",J57,0)))","v":0},1000,null,400,null,200]
[null,null,"Terapia / Meditação",2,0,{"$f":"4.4*250","v":1100},null,{"$f":"4.4*180","v":792.00000000000011},null,{"$f":"2*180","v":360}]
[null,null,"Saúde (remédio, consultas)",2,0,600,null,200,null,100]
[null,null,"Dentista",2,0,100,null,50,null,20]
[null,null,"Jantares com Amigos / Família",2,0,{"$f":"4*2*100","v":800},null,{"$f":"4*1.5*90","v":540},null,{"$f":"4*1*50","v":200}]
[null,null,"Celular",2,0,300,null,140,null,50]
[null,null,"Presentes para ocasiões especiais (Parentes, Amigos)",2,0,300,null,150,null,100]
[null,null,"Empregada/Faxineira",0,{"$f":"IF(G64=\"x\",F64,IF(I64=\"x\",H64,IF(K64=\"x\",J64,0)))","v":0},{"$f":"(110*5*4.4)*1.6","v":3872},null,{"$f":"(120*2*4.4)","v":1056},null,{"$f":"(75*2*4.4)","v":660}]
[null,null,"Escola de Linguas (Adulto)",2,0,{"$f":"180*2*4.4","v":1584.0000000000002},null,{"$f":"120*2*4.4","v":1056},null,{"$f":"100*2*4.4","v":880.00000000000011}]
[null,null,"Pós-Graduação / MBA (considerando o casal)",{"$f":"($D$46+(IF($D$10=\"Casado(a)\",2,IF($E$11<>\"\",1,0))+IF(COUNTA(D15)-COUNTA(D18)=0,0,D15)))","v":2},0,2500,null,1500,null,500]
[null,null,"Cinema & Pipoca per capta da família",{"$f":"($D$46+(IF($D$10=\"Casado(a)\",2,IF($E$11<>\"\",1,0))+IF(COUNTA(D14)-COUNTA(D17)=0,0,D14)))","v":2},0,{"$f":"3*25","v":75},null,{"$f":"2*20","v":40},null,{"$f":"1*25","v":25}]
[null,null,"Mensalidade Clube",{"$f":"($D$46+COUNTA($E$11:$F$11)+IF(COUNTA($D$14)-COUNTA($D$17)>0,$D$14,0))","v":0},0,300,null,120,null,0]
[null,null,"Viagem de Férias",{"$f":"($D$46+COUNTA($E$11:$F$11)+IF(COUNTA($D$14)-COUNTA($D$17)>0,$D$14,0))","v":0},0,{"$f":"8000/12","v":666.66666666666663},null,{"$f":"6000/12","v":500},null,{"$f":"2000/12","v":166.66666666666666}]
[null,null,"Farmácia per capta da família",{"$f":"($D$46+(IF($D$10=\"Casado(a)\",2,IF($E$11<>\"\",1,0))+IF(COUNTA(D14)-COUNTA(D17)=0,0,D14)))","v":2},0,350,null,200,null,100]
[null,null,"Roupa per capta da família",{"$f":"($D$46+(IF($D$10=\"Casado(a)\",2,IF($E$11<>\"\",1,0))+IF(COUNTA(D14)-COUNTA(D17)=0,0,D14)))","v":2},0,120,null,60,null,30]
[null,null,"Escola de Linguas (Infantil)",{"$f":"($D$46+IF(COUNTA($D$14)-COUNTA($D$17)>0,$D$14,0))","v":0},0,{"$f":"180*2*4.4","v":1584.0000000000002},null,{"$f":"120*2*4.4","v":1056},null,{"$f":"100*2*4.4","v":880.00000000000011}]
[null,null,"Baba",{"$f":"IF((D46+COUNTIF(D14,1)+COUNTIF(D14,2)+COUNTIF(D14,3)+COUNTIF(D14,4)+COUNTIF(D14,5)+COUNTIF(D14,6)-COUNTA(D17))>0,1,0)","v":0},0,{"$f":"(150*5*4)*1.6","v":4800},null,{"$f":"(120*5*4)*1.6","v":3840},null,{"$f":"(90*2*4)*1.6","v":1152}]
[null,null,"Escola",{"$f":"($D$46+IF(COUNTA($D$14)-COUNTA($D$17)>0,$D$14,0))","v":0},{"$f":"IF(G74=\"x\",F74,IF(I74=\"x\",H74,IF(K74=\"x\",J74,0)))","v":0},3500,null,2000,null,1000]
[null,null,"Motorista",{"$f":"IF((D46+COUNTIF(D14,1)+COUNTIF(D14,2)+COUNTIF(D14,3)+COUNTIF(D14,4)+COUNTIF(D14,5)+COUNTIF(D14,6)-COUNTA(D17))>0,1,0)","v":0},0,5500,null,3500,null,3500]
[null,null,"Transporte Escolar",0,0,580,null,226,null,150]
[null,null,"Material Escolar (mensalizado)",0,0,50,null,40,null,20]
[null,null,"Livros de Escola / Revistas / Etc (mês)",0,0,100,null,50,null,20]
[null,null,"Uniforme Escolar (mensalizado)",0,0,37.5,null,{"$f":"200/12","v":16.666666666666668},null,10]
[null,null,"Atividades fora da Escola (passeios) por pessoa mês",0,0,{"$f":"1200/12","v":100},null,{"$f":"800/12","v":66.666666666666671},null,{"$f":"300/12","v":25}]
[null,null,"Alimentação (Supermercado, lanches escola/esporte, etc)",{"$f":"($D$46+(IF($D$10=\"Casado(a)\",2,IF($E$11<>\"\",1,0))+IF(COUNTA(D14)-COUNTA(D17)=0,0,D14)))","v":2},0,1500,null,1000,null,650]
[null,null,"Outros (preencher)",{"$f":"($D$46+(IF($D$10=\"Casado(a)\",2,IF($E$11<>\"\",1,0))+IF(COUNTA(D13)-COUNTA(D16)=0,0,D13)))","v":2}]
[null,null,"Outros (preencher)",2]
[null,null,"Outros (preencher)",2]
[null,null,"Outros (preencher)",{"$f":"($D$46+(IF($D$10=\"Casado(a)\",2,IF($E$11<>\"\",1,0))+IF(COUNTA(D16)-COUNTA(D19)=0,0,D16)))","v":2},0]
[null,null,"Total Mensal Esperado",null,{"$f":"SUMPRODUCT(E49:E85,D49:D85)","v":0}]
[]
[]
[]
[null,null,{"$f":"+D20","v":"Salario(s) Líquido na conta corrente (média mensal incluindo bonus, etc)"}]
[]
[null,null,"Renda Atual x Despesa Projetada"]
[null,null,"Renda",{"$f":"+D19","v":0}]
[null,null,"Despesa Projetada",{"$f":"-(E86+D17)","v":0}]
[null,null,"Saldo Final (mês)",{"$f":"+D93+D94","v":0}]
[]
[]
[null,null,"Estime uma Renda Média para Estes Anos Produtivos tomando por base a renda atual",{"$f":"IF($D$10=\"Solteiro(a)\",\"Mulher/Homem\",\"Mulher\")","v":"Mulher"},{"$f":"IF(D10=\"Solteiro(a)\",\"\",\"Homem\")","v":"Homem"}]
[null,null,"Salario(s) Líquido na conta corrente",{"$f":"E20","v":0},{"$f":"F20","v":0}]
[null,null,"Aluguel de Imóvel(s)",{"$f":"E21","v":0},0]
[null,null,"Pensão Recebida",{"$f":"E20","v":0},{"$f":"F20","v":0}]
[null,null,"Outros",{"$f":"E21","v":0},0]
[null,null,"Total",0,0]
[]
[null,null,"Reserva Projetada para o fim dos Anos Produtivos"]
[null,null,"Renda",{"$f":"SUM(D103:E103)","v":0}]
[null,null,"Disponibilidade (aplicação - divida)",{"$f":"+D25-D36","v":0}]
[null,null,"Pensão Alimentícia",{"$f":"(IF(F14<>\"\",-D17/D14*12*(21-F15),0)-IF(G14<>\"\",D17/D14*12*(21-G15),0)-IF(H14<>\"\",D17/D14*12*(21-H15),0)-IF(I14<>\"\",D17/D14*12*(21-I15),0)-IF(J14<>\"\",D17/D14*12*(21-J15),0)-IF(K14<>\"\",D17/D14*12*(21-K15),0))","v":0}]
[null,null,"Despesas projetadas",{"$f":"-E86*F44*12","v":0}]
[null,null,"Reserva de Caixa (R$) Acumulada",{"$f":"SUM(D106:D109)","v":0}]
[]
[null,null,"Disponibilidade Financeira",{"$f":"D25","v":0}]
[]
[null,null,"Patrimônio da Família ao fim dos anos Produtivos",{"$f":"+D110+D27","v":0}]

{"sheet":"Input (2)","index":4,"n_rows":105,"n_cols":16,"rows_kept":105,"cut":false,"hidden":true,"merged":[[82,2,82,11],[84,2,84,3],[2,3,4,10],[7,2,7,11],[45,2,45,11],[53,5,53,6],[53,7,53,8],[53,9,53,10]]}
[]
[]
[null,null,null,"Ferramenta de Planejamento Financeiro"]
[]
[]
[]
[]
[null,null,"Situação Atual"]
[]
[null,null,"Estado Civil","Casado(a)",{"$f":"IF(D10=\"Solteiro(a)\",\"Mulher/Homem\",\"Mulher\")","v":"Mulher"},{"$f":"IF(D10=\"Solteiro(a)\",\"\",\"Homem\")","v":"Homem"},1,2,3,4,5,6,6,7,8,9]
[null,null,null,"Idade:",35,40]
[]
[]
[null,null,"Filhos",3]
[null,null,{"$f":"IF(D14>0,\"Valor Pago de Pensão Alimentícia\",\"\")","v":"Valor Pago de Pensão Alimentícia"},9500]
[]
[null,null,{"$f":"IF(D14>0,\"Valores gastos por filho fora pensão\",\"\")","v":"Valores gastos por filho fora pensão"},null,{"$f":"IF($D$14>0,\"1o Filho\",\"\")","v":"1o Filho"},{"$f":"IF($D$14>G10,\"2o Filho\",\"\")","v":"2o Filho"},{"$f":"IF($D$14>H10,\"3o Filho\",\"\")","v":"3o Filho"},{"$f":"IF($D$14>I10,\"4o Filho\",\"\")","v":""},{"$f":"IF($D$14>J10,\"5o Filho\",\"\")","v":""},{"$f":"IF($D$14>K10,\"6o Filho\",\"\")","v":""},{"$f":"IF($D$14>L10,\"7o Filho\",\"\")","v":""}]
[null,null,null,{"$f":"IF($D$14>0,\"Idade:\",\"\")","v":"Idade:"}]
[null,null,null,{"$f":"IF($D$14>0,\"Gasto Escolar:\",\"\")","v":"Gasto Escolar:"}]
[null,null,null,{"$f":"IF($D$14>0,\"Gasto Atividades Extra Escolares:\",\"\")","v":"Gasto Atividades Extra Escolares:"}]
[null,null,null,{"$f":"IF($D$14>0,\"Média de Outros Gastos Diversos atribuiveis individualmente:\",\"\")","v":"Média de Outros Gastos Diversos atribuiveis individualmente:"}]
[]
[null,null,"Renda Familiar Mensal",{"$f":"+E24+E25+E27+F24+F25+F27","v":29000},{"$f":"IF(D10=\"Solteiro(a)\",\"Mulher/Homem\",\"Mulher\")","v":"Mulher"},{"$f":"IF(D10=\"Solteiro(a)\",\"\",\"Homem\")","v":"Homem"}]
[null,null,null,"Salario(s) Líquido na conta corrente (média mensal incluindo bonus, etc)",8500,9000]
[null,null,null,"Aluguel de Imóvel(s)",null,5500]
[null,null,null,"Pensão Recebida",null,0]
[null,null,null,"Outros",null,6000]
[]
[null,null,"Disponibilidade (dinheiro e aplicações em conta com liquidez inferior a 12 meses)",1200000]
[]
[null,null,"Patrimônio (excluindo disponibilidades) a valor de mercado hoje aproximadamente",{"$f":"SUM(E32:F38)","v":5345000},{"$f":"IF(D10=\"Solteiro(a)\",\"Mulher/Homem\",\"Mulher\")","v":"Mulher"},{"$f":"IF(D10=\"Solteiro(a)\",\"\",\"Homem\")","v":"Homem"}]
[null,null,"Imóvel Residencial",{"$f":"SUM(E32:F32)","v":1300000},650000,650000]
[null,null,"Escritório Comercial",{"$f":"SUM(E33:F33)","v":1350000},null,1350000]
[null,null,"Galpão",0,null,0]
[null,null,"Fazenda",0,null,0]
[null,null,"Outros Imóveis",2650000,null,{"$f":"800000+1850000","v":2650000}]
[null,null,"Automóvel",45000,45000]
[null,null,"Outros Bens",0]
[]
[null,null,"Dívida (financiamento/emprestimos)",{"$f":"SUM(E41:F42)","v":350000},{"$f":"IF(D10=\"Solteiro(a)\",\"Mulher/Homem\",\"Mulher\")","v":"Mulher"},{"$f":"IF(D10=\"Solteiro(a)\",\"\",\"Homem\")","v":"Homem"}]
[null,null,"Financiamento",{"$f":"SUM(E41:F41)","v":0}]
[null,null,"Emprestimos familiares",{"$f":"SUM(E42:F42)","v":350000},null,350000]
[]
[]
[]
[null,null,"Planejamento Familiar"]
[null,null,null,null,{"$f":"IF(D10=\"Casado(a)\",\"Mulher\",\"\")","v":"Mulher"},{"$f":"IF(D10=\"Casado(a)\",\"Homem\",\"\")","v":"Homem"}]
[null,null,"Quando tempo mais deseja trabalhar?",null,5,10]
[]
[null,null,"Quanto deseja ter de recursos por mês em sua aposentadoria? (a valor atual)",15000]
[]
[null,null,"Quantos filhos pretende ter?",1]
[]
[null,null,null,"Pessoas Consideradas","Valores Considerados","PADRÃO SUPERIOR (R$)",null,"MÉDIA (R$)",null,"PADRÃO INFERIOR (R$)"]
[null,null,"Condomínio / Iptu",1,{"$f":"IF(G55=\"x\",F55,IF(I55=\"x\",H55,IF(K55=\"x\",J55,0)))","v":1500},2500,null,1500,"x",1000]
[null,null,"Água",1,100,100,"x",30,null,15]
[null,null,"Energia Elétrica",1,220,450,null,220,"x",110]
[null,null,"TV / Internet Cabo",1,250,450,null,250,"x",80]
[null,null,"Aluguel",1,0,6000,null,2500,null,1100]
[null,null,"Baba",{"$f":"IF((D52+COUNTA(E18:K18))>0,1,0)","v":1},{"$f":"IF(G60=\"x\",F60,IF(I60=\"x\",H60,IF(K60=\"x\",J60,0)))","v":3840},{"$f":"(150*5*4)*1.6","v":4800},null,{"$f":"(120*5*4)*1.6","v":3840},"x",{"$f":"(90*2*4)*1.6","v":1152}]
[null,null,"Empregada/Faxineira",1,{"$f":"IF(G61=\"x\",F61,IF(I61=\"x\",H61,IF(K61=\"x\",J61,0)))","v":1056},{"$f":"(110*5*4.4)*1.6","v":3872},null,{"$f":"(120*2*4.4)","v":1056},"X",{"$f":"(75*2*4.4)","v":660}]
[null,null,"Escola",{"$f":"($D$52+COUNTA($E$18:$K$18))","v":1},2000,3500,null,2000,"X",1000]
[null,null,"Combustível",{"$f":"ROUNDUP(D37/50000,0)","v":1},240,{"$f":"240*2","v":480},null,240,"X",120]
[null,null,"Motorista",1,0,5500,null,3500,null,3500]
[null,null,"Mensalidade Clube",{"$f":"($D$52+COUNTA($E$18:$K$18))","v":1},300,300,"X",120,null,0]
[null,null,"Transporte Escolar",1,226,580,null,226,"X",150]
[null,null,"Material Escolar (mensalizado)",1,40,50,null,40,"X",20]
[null,null,"Livros de Escola / Revistas / Etc (mês)",1,50,100,null,50,"X",20]
[null,null,"Uniforme Escolar (mensalizado)",1,16.666666666666668,37.5,null,{"$f":"200/12","v":16.666666666666668},"X",10]
[null,null,"Atividades fora da Escola (passeios) por pessoa mês",1,66.666666666666671,{"$f":"1200/12","v":100},null,{"$f":"800/12","v":66.666666666666671},"X",{"$f":"300/12","v":25}]
[null,null,"Escola de Linguas",1,1056,{"$f":"180*2*4.4","v":1584.0000000000002},null,{"$f":"120*2*4.4","v":1056},"X",{"$f":"100*2*4.4","v":880.00000000000011}]
[null,null,"Reposição de Automóvel (provisão mensal)",{"$f":"ROUNDUP(D37/50000,0)","v":1},1125,{"$f":"+($D$37*2)/(5*12)","v":1500},null,{"$f":"+($D$37*1.5)/(5*12)","v":1125},"X",{"$f":"+($D$37*1)/(5*12)","v":750}]
[null,null,"Viagem de Férias",{"$f":"($D$52+(IF($D$10=\"Casado(a)\",2,1))+COUNTA($E$18:$K$18))","v":3},666.66666666666663,{"$f":"8000/12","v":666.66666666666663},"x",{"$f":"6000/12","v":500},null,{"$f":"2000/12","v":166.66666666666666}]
[null,null,"Compra de bens não duráveis",3,250,{"$f":"4000/12","v":333.33333333333331},null,{"$f":"3000/12","v":250},"X",83.333333333333329]
[null,null,"Alimentação (Supermercado, lanches escola/esporte, etc)",3,1000,1500,null,1000,"X",650]
[null,null,"Farmácia per capta da família",3,200,350,null,200,"X",100]
[null,null,"Cinema & Pipoca per capta da família",3,40,{"$f":"3*25","v":75},null,{"$f":"2*20","v":40},"X",{"$f":"1*25","v":25}]
[null,null,"Roupa per capta da família",3,120,120,"X",60,null,30]
[null,null,"Total Mensal Esperado",null,{"$f":"SUMPRODUCT(E55:E78,D55:D78)","v":18916.333333333332}]
[]
[]
[]
[null,null,"Reultados"]
[]
[null,null,"Renda Atual x Despesa Projetada"]
[null,null,"Renda",{"$f":"+D23","v":29000}]
[null,null,"Despesa Projetada",{"$f":"-(E79+D15)","v":-28416.333333333332}]
[null,null,"Saldo Final (mês)",{"$f":"+D86+D87","v":583.66666666666788}]
[]
[]
[null,null,"Renda Projetada para Estes Anos Produtivos",{"$f":"IF($D$10=\"Solteiro(a)\",\"Mulher/Homem\",\"Mulher\")","v":"Mulher"},{"$f":"IF(D10=\"Solteiro(a)\",\"\",\"Homem\")","v":"Homem"}]
[null,null,"Salario(s) Líquido na conta corrente",8500,9000]
[null,null,"Aluguel de Imóvel(s)",null,9000]
[null,null,"Pensão Recebida",null,0]
[null,null,"Outros"]
[null,null,"Total",{"$f":"SUM(D92:D95)*E48*12","v":510000},{"$f":"SUM(E92:E95)*F48*12","v":2160000}]
[]
[null,null,"Reserva Projetada para o fim dos Anos Produtivos"]
[null,null,"Renda",{"$f":"SUM(D96:E96)","v":2670000}]
[null,null,"Disponibilidade (aplicação - divida)",{"$f":"+D29-D40","v":850000}]
[null,null,"Pensão Alimentícia",{"$f":"-D15*F48*12","v":-1140000}]
[null,null,"Despesas projetadas",{"$f":"-E79*F48*12","v":-2269960}]
[null,null,"Reserva de Caixa (R$) Acumulada",{"$f":"SUM(D99:D102)","v":110040}]
[]
[null,null,"Patrimônio da Família ao fim dos anos Produtivos",{"$f":"+D103+D31","v":5455040}]